{"text_format":"1","workbook":"xlsx","n_sheets":20,"sheets":["Instructions","Print","Name","F118","Gen06","Fed07","PK AtRsk11","K-12AtRsk13","Cap16","Ext22","Food24","Prof26","PAT28","SuS29","SpE30","Voc34","Misc35","C099","Salaries","Roll Over"],"not_rendered":{"charts":0,"images":0,"macros":1,"external_links":0,"defined_names":77,"comments":1,"pivot_tables":0},"unopened":[],"bounds":{"document_bytes":16777216,"sheet_cells":100000,"rows_first":2000,"rows_last":500,"rows_between":2000,"halvings":0,"cell_chars":16384,"cell_head_chars":4096},"cells_cut":0,"cells_raw":0,"read":"whole","date_system":"1904"}

{"sheet":"Instructions","index":0,"n_rows":16,"n_cols":5,"rows_kept":16,"cut":false,"hidden":false,"merged":[]}
[]
[]
[null,null,"Budget, Printing & Submission Guidance"]
[null,null,"Interlocal Budget Website"]
[null,null,"User's Guide"]
[null,null,"Issues Report"]
[]
[null,null,"Contacts"]
[null,null,"Budget Questions"]
[null,null,"Sara (Barnes) McCullah",7852964972,"smccullah@ksde.org"]
[null,null,"Dale Brungardt",7852963872,"dbrungardt@ksde.org"]
[null,null,"Craig Neuenswander",7852963871,"craign@ksde.org"]
[]
[null,null,"Excel or LEA Forms Questions"]
[null,null,"Sara (Barnes) McCullah",7852964972,"smccullah@ksde.org"]
{"$rows_left_out":2}
{"sheet":"Print","index":1,"n_rows":20,"n_cols":7,"rows_kept":20,"cut":false,"hidden":false,"merged":[[0,0,0,6],[4,6,7,6],[4,0,4,1],[9,0,9,1],[1,0,1,1],[9,6,14,6]]}
["Select the Forms you want to print:  "]
["Windows & Mac Users",null,"(Put an X next to the Worksheet you would like to print then click on \"Print Selected Worksheets\")"]
[]
[null,null,"x","Name",{"$f":"IF(C4=\"x\",D4,\"\")","v":"Name"},"Interlocal Name - Cover page","Mac Users"]
["Print (Windows Users only)",null,"x","F118",{"$f":"IF(C5=\"x\",D5,\"\")","v":"F118"},"Est. Special Education ","Unfortunately, the buttons on this tab to print and create PDFs only work on Windows.  Please use the instructions on page 14 of the Users' Guide to print your budget."]
[null,null,{"$f":"IF(SUM('Gen06'!$C$22:$E$22)>0,\"x\",\"\")","v":""},"Gen06","","General Fund"]
[null,null,{"$f":"IF(SUM('Fed07'!$C$23:$E$23)>0,\"x\",\"\")","v":""},"Fed07","","Federal Funds"]
[null,null,{"$f":"IF(SUM('PK AtRsk11'!$C$22:$E$22)>0,\"x\",\"\")","v":""},"PK AtRsk11","","Preschool-Aged At-Risk"]
[null,null,{"$f":"IF(SUM('K-12AtRsk13'!$C$22:$E$22)>0,\"x\",\"\")","v":""},"K-12AtRsk13","","At Risk Fund (K-12)","Users' Guide"]
["PDF's (Windows Users only)",null,{"$f":"IF(SUM('Cap16'!$C$24:$E$24)>0,\"x\",\"\")","v":""},"Cap16","","Capital Outlay Fund","Once you have used the instructions in the Users' Guide to print, please make sure to use the \"Ungroup Sheets\" buttons on any tab to ungroup the sheets before SAVING and electronically submitting your budget."]
[null,null,{"$f":"IF(SUM('Ext22'!$C$20:$E$20)>0,\"x\",\"\")","v":""},"Ext22","","Extraordinary School Fund"]
[null,null,{"$f":"IF(SUM(Food24!$C$29:$E$29)>0,\"x\",\"\")","v":""},"Food24","","Food Service Fund"]
[null,null,{"$f":"IF(SUM(Prof26!$C$23:$E$23)>0,\"x\",\"\")","v":""},"Prof26","","Professional Development Fund"]
[null,null,{"$f":"IF(SUM('PAT28'!$C$24:$E$24)>0,\"x\",\"\")","v":""},"PAT28","","Parent Education Program Fund"]
[null,null,{"$f":"IF(SUM('SuS29'!$C$19:$E$19)>0,\"x\",\"\")","v":""},"SuS29","","Summer School Fund"]
{"$rows_left_out":6}
{"sheet":"Name","index":2,"n_rows":26,"n_cols":5,"rows_kept":26,"cut":false,"hidden":false,"merged":[[18,0,18,1],[19,0,19,1],[20,0,20,1],[1,0,1,1],[2,0,2,1]]}
["Interlocal #",null,602,"Northwest KS Educational Serv Cntr",{"$f":"+B1","v":0}]
[{"$f":"IFERROR(VLOOKUP(B1,$C$1:$D$39,2,FALSE),\"\")","v":""},null,603,"ANW Special Education Cooperative",{"$f":"+A2","v":""}]
[{"$f":"'Roll Over'!C3&\" Interlocal Budget\"","v":"2023-2024 Interlocal Budget"},null,605,"South Central KS Spec Ed Coop"]
[null,null,607,"Tri County Special Education Coop"]
[null,null,608,"Northeast KS Education Serv Cntr"]
[null,null,609,"Southeast KS Education Serv Center"]
[null,null,610,"Reno County Education Cooperative"]
[null,null,611,"High Plains Educational Cooperative"]
[null,null,613,"Southwest Kansas Area Cooperative"]
[null,null,614,"East Central KS Coop in Educ"]
[null,null,615,"Brown Co KS Special Ed Coop"]
[null,null,616,"Doniphan Co Education Coop"]
[null,null,617,"Marion County Special Education"]
[null,null,618,"Sedgwick Co Area Educational Servs"]
[null,null,619,"Sumner Co Educational Services"]
{"$rows_left_out":12}
{"sheet":"F118","index":3,"n_rows":49,"n_cols":5,"rows_kept":49,"cut":false,"hidden":false,"merged":[[38,1,38,2],[36,1,36,3],[3,0,3,4],[6,0,6,4],[7,0,7,4],[17,0,17,4],[18,0,18,4],[12,1,12,3],[14,1,14,3],[32,1,32,3],[48,1,48,3],[31,1,31,3],[4,0,5,4],[21,1,21,3],[23,1,23,3],[25,1,25,3],[27,1,27,3],[29,1,29,3],[19,1,19,3],[8,1,8,3],[15,1,15,3],[34,1,34,3],[46,1,46,3],[44,1,44,3],[42,1,42,3],[40,1,40,3]]}
["State of Kansas",null,null,null,{"$f":"\"Interlocal #\"&Name!$B$1","v":"Interlocal #"}]
["Budget Form 0-135-118",null,null,null,{"$f":"+Name!$A$2","v":""}]
[{"$f":"'Roll Over'!E1","v":"Rev. 6/2023"},null,null,null,{"$f":"LEFT(Name!A3,9)","v":"2023-2024"}]
["Form 118"]
[{"$f":"E3&\" Estimated Special Education Revenue\"","v":"2023-2024 Estimated Special Education Revenue"}]
[]
["General Aid"]
["(This form should be included with the budget document and filed with the State Department of Education)"]
["1.","Estimated number of Special Education Teachers (FTE*)"]
[]
["2.","Estimated (FTE*) Special Education Paraprofessionals ",null,"x 0.4 = ",{"$f":"SUM(C11*0.4)","v":0}]
[]
["3.","Total number of Special Education Teachers (#1 + #2)",null,null,{"$f":"SUM(E9:E11)","v":0}]
[]
["4.",{"$f":"\"Estimated State Aid due from 7-1-\"&'Roll Over'!F4&\" to 6-30-\"&'Roll Over'!H4&\" (#3 x $\"&'Roll Over'!E7&\",\"&'Roll Over'!F7&\")\"","v":"Estimated State Aid due from 7-1-2023 to 6-30-2024 (#3 x $30,800)"},null,null,{"$f":"SUM(E13*'Roll Over'!C7)","v":0}]
{"$rows_left_out":35}
{"sheet":"Gen06","index":4,"n_rows":263,"n_cols":5,"rows_kept":263,"cut":false,"hidden":false,"merged":[[5,0,7,0],[264,0,264,4],[262,0,262,4],[33,0,33,4],[32,0,32,4],[10,0,10,4],[11,0,11,4],[29,0,31,0]]}
["State of Kansas",null,null,null,{"$f":"\"Interlocal #\"&Name!$B$1","v":"Interlocal #"}]
["Budget Form 0-212-900",null,null,null,{"$f":"Name!$A$2","v":""}]
[{"$f":"'Roll Over'!E1","v":"Rev. 6/2023"},null,null,null,{"$f":"LEFT(Name!A3,9)","v":"2023-2024"}]
[]
[null,null,1,2,3]
["GENERAL ","Code",{"$f":"'Roll Over'!C1","v":"2021-2022"},{"$f":"'Roll Over'!C2","v":"2022-2023"},{"$f":"'Roll Over'!C3","v":"2023-2024"}]
[null,6,"Actual","Actual","Budget"]
[null,"Line","12 mo.","12 mo.","12 mo."]
["UNENCUMBERED CASH BAL. - JULY 1 ",1,null,{"$f":"C23","v":0},{"$f":"D23","v":0}]
["Cancel of Prior Year Encumbrances",3]
[]
["REVENUES"]
["1000 LOCAL SOURCES"]
["    1320 Payment from Districts",40]
["    1510 Interest on Idle Funds",47]
{"$rows_left_out":249}
{"sheet":"Fed07","index":5,"n_rows":232,"n_cols":5,"rows_kept":232,"cut":false,"hidden":false,"merged":[[5,0,7,0],[10,0,10,4],[11,0,11,4],[34,0,36,0],[37,0,37,4],[24,0,24,4],[38,0,38,4],[231,0,231,4],[25,0,25,4],[26,0,26,4],[27,0,27,4]]}
["State of Kansas",null,null,null,{"$f":"\"Interlocal #\"&Name!B1","v":"Interlocal #"}]
["Budget Form 0-212-900",null,null,null,{"$f":"Name!A2","v":""}]
[{"$f":"'Roll Over'!E1","v":"Rev. 6/2023"},null,null,null,{"$f":"LEFT(Name!A3,9)","v":"2023-2024"}]
[]
[null,null,1,2,3]
["FEDERAL FUNDS*","Code",{"$f":"'Roll Over'!C1","v":"2021-2022"},{"$f":"'Roll Over'!C2","v":"2022-2023"},{"$f":"'Roll Over'!C3","v":"2023-2024"}]
[null,7,"Actual","Actual","Budget"]
[null,"Line","12 mo.","12 mo.","12 mo."]
["UNENCUMBERED CASH BAL. - JULY 1 ",1,null,{"$f":"C24","v":0},{"$f":"D24","v":0}]
["Cancel of Prior Year Encumbrances",3]
[]
["REVENUE"]
["4000 FEDERAL SOURCES - GRANTS"]
["  4591 Title I",10]
["  4593 Title II",15]
{"$rows_left_out":218}
{"sheet":"PK AtRsk11","index":6,"n_rows":160,"n_cols":5,"rows_kept":160,"cut":false,"hidden":false,"merged":[[159,0,159,4],[10,0,10,4],[11,0,11,4],[5,0,7,0],[23,0,23,4],[33,0,33,4],[29,0,31,0]]}
["State of Kansas",null,null,null,{"$f":"\"Interlocal #\"&Name!B1","v":"Interlocal #"}]
["Budget Form 0-212-900",null,null,null,{"$f":"Name!A2","v":""}]
[{"$f":"'Roll Over'!E1","v":"Rev. 6/2023"},null,null,null,{"$f":"LEFT(Name!A3,9)","v":"2023-2024"}]
[]
[null,null,1,2,3]
["PRESCHOOL-AGED AT-RISK\n(3 Year Old and 4 Year Old)","Code",{"$f":"'Roll Over'!C1","v":"2021-2022"},{"$f":"'Roll Over'!C2","v":"2022-2023"},{"$f":"'Roll Over'!C3","v":"2023-2024"}]
[null,11,"Actual","Actual","Budget"]
[null,"Line","12 mo.","12 mo.","12 mo."]
["UNENCUMBERED CASH BAL. -  JULY 1 ",1,null,{"$f":"C23","v":0},{"$f":"D23","v":0}]
["Cancel of Prior Year Encumbrances",3]
[]
["REVENUES"]
["1000 LOCAL SOURCES              "]
["    1320 Payment from Districts  ",25]
["    1510 Interest on Idle Funds   ",35]
{"$rows_left_out":146}
{"sheet":"K-12AtRsk13","index":7,"n_rows":161,"n_cols":10,"rows_kept":161,"cut":false,"hidden":false,"merged":[[141,6,144,9],[160,0,160,4],[5,0,7,0],[32,0,32,4],[33,0,33,4],[10,0,10,4],[11,0,11,4],[29,0,31,0]]}
["State of Kansas",null,null,null,{"$f":"\"Interlocal #\"&Name!B1","v":"Interlocal #"}]
["Budget Form 0-212-900",null,null,null,{"$f":"Name!A2","v":""}]
[{"$f":"'Roll Over'!E1","v":"Rev. 6/2023"},null,null,null,{"$f":"LEFT(Name!A3,9)","v":"2023-2024"},null,null,null,null,"At-Risk Pupil Assistance Program Guidelines"]
[]
[null,null,1,2,3,null,null,null,null,"Evidence-Based Best Practices Homepage"]
["AT RISK FUND (K-12) ","Code",{"$f":"'Roll Over'!C1","v":"2021-2022"},{"$f":"'Roll Over'!C2","v":"2022-2023"},{"$f":"'Roll Over'!C3","v":"2023-2024"}]
[null,13,"Actual","Actual","Budget"]
[null,"Line","12 mo.","12 mo.","12 mo."]
["UNENCUMBERED CASH BAL. - JULY 1 ",1,null,{"$f":"C23","v":0},{"$f":"D23","v":0}]
["Cancel of Prior Year Encumbrances",3]
[]
["REVENUES"]
["1000 LOCAL SOURCES              "]
["    1320 Payment from Districts  ",25]
["    1510 Interest on Idle Funds   ",35]
{"$rows_left_out":147}
{"sheet":"Cap16","index":8,"n_rows":106,"n_cols":5,"rows_kept":106,"cut":false,"hidden":false,"merged":[[105,0,105,4],[5,0,7,0],[10,0,10,4],[11,0,11,4],[35,0,35,4],[34,0,34,4],[31,0,33,0]]}
["State of Kansas",null,null,null,{"$f":"\"Interlocal #\"&Name!B1","v":"Interlocal #"}]
["Budget Form 0-212-900",null,null,null,{"$f":"Name!A2","v":""}]
[{"$f":"'Roll Over'!E1","v":"Rev. 6/2023"},null,null,null,{"$f":"LEFT(Name!A3,9)","v":"2023-2024"}]
[]
[null,null,1,2,3]
["CAPITAL OUTLAY ","Code",{"$f":"'Roll Over'!C1","v":"2021-2022"},{"$f":"'Roll Over'!C2","v":"2022-2023"},{"$f":"'Roll Over'!C3","v":"2023-2024"}]
[null,16,"Actual","Actual","Budget"]
[null,"Line","12 mo.","12 mo.","12 mo."]
["UNENCUMBERED CASH BAL. - JULY 1 ",1,null,{"$f":"C25","v":0},{"$f":"D25","v":0}]
["Cancel of Prior Year Encumbrances",3]
[]
["REVENUES"]
["1000 LOCAL SOURCES                  "]
["    1320 Payment from Districts",40]
["    1510 Interest on Idle Funds",47]
{"$rows_left_out":92}
{"sheet":"Ext22","index":9,"n_rows":155,"n_cols":5,"rows_kept":155,"cut":false,"hidden":false,"merged":[[10,0,10,4],[11,0,11,4],[30,0,31,4],[154,0,154,4],[5,0,7,0],[27,0,29,0]]}
["State of Kansas",null,null,null,{"$f":"\"Interlocal #\"&Name!B1","v":"Interlocal #"}]
["Budget Form 0-212-900",null,null,null,{"$f":"Name!A2","v":""}]
[{"$f":"'Roll Over'!E1","v":"Rev. 6/2023"},null,null,null,{"$f":"LEFT(Name!A3,9)","v":"2023-2024"}]
[]
[null,null,1,2,3]
["EXTRAORDINARY SCHOOL PROGRAM","Code",{"$f":"'Roll Over'!C1","v":"2021-2022"},{"$f":"'Roll Over'!C2","v":"2022-2023"},{"$f":"'Roll Over'!C3","v":"2023-2024"}]
[null,22,"Actual","Actual","Budget"]
[null,"Line","12 mo.","12 mo.","12 mo."]
["UNENCUMBERED CASH BAL. - JULY 1 ",1,null,{"$f":"C21","v":0},{"$f":"D21","v":0}]
["Cancel of Prior Year Encumbrances",3]
[]
["REVENUES"]
["1000 LOCAL SOURCES                  "]
["    1320 Payment from Districts",5]
["    1510 Interest on Idle Funds",10]
{"$rows_left_out":141}
{"sheet":"Food24","index":10,"n_rows":82,"n_cols":5,"rows_kept":82,"cut":false,"hidden":false,"merged":[[39,0,40,4],[10,0,10,4],[11,0,11,4],[5,0,7,0],[81,0,81,4],[36,0,38,0]]}
["State of Kansas",null,null,null,{"$f":"\"Interlocal #\"&Name!B1","v":"Interlocal #"}]
["Budget Form 0-212-900",null,null,null,{"$f":"Name!A2","v":""}]
[{"$f":"'Roll Over'!E1","v":"Rev. 6/2023"},null,null,null,{"$f":"LEFT(Name!A3,9)","v":"2023-2024"}]
[]
[null,null,1,2,3]
["FOOD SERVICE ","Code",{"$f":"'Roll Over'!C1","v":"2021-2022"},{"$f":"'Roll Over'!C2","v":"2022-2023"},{"$f":"'Roll Over'!C3","v":"2023-2024"}]
[null,24,"Actual","Actual","Budget"]
[null,"Line","12 mo.","12 mo.","12 mo."]
["UNENCUMBERED CASH BAL. - JULY 1",1,null,{"$f":"C30","v":0},{"$f":"D30","v":0}]
["Cancel of Prior Year Encumbrances",3]
[]
["REVENUES"]
["1000 LOCAL SOURCES              "]
["  1510 Interest on Idle Funds   ",5]
["  1600 Food Service             "]
{"$rows_left_out":68}
{"sheet":"Prof26","index":11,"n_rows":83,"n_cols":5,"rows_kept":83,"cut":false,"hidden":false,"merged":[[5,0,7,0],[10,0,10,4],[11,0,11,4],[33,0,34,4],[82,0,82,4],[30,0,32,0]]}
["State of Kansas",null,null,null,{"$f":"\"Interlocal #\"&Name!B1","v":"Interlocal #"}]
["Budget Form 0-212-900",null,null,null,{"$f":"Name!A2","v":""}]
[{"$f":"'Roll Over'!E1","v":"Rev. 6/2023"},null,null,null,{"$f":"LEFT(Name!A3,9)","v":"2023-2024"}]
[]
[null,null,1,2,3]
["PROFESSIONAL DEVELOPMENT","Code",{"$f":"'Roll Over'!C1","v":"2021-2022"},{"$f":"'Roll Over'!C2","v":"2022-2023"},{"$f":"'Roll Over'!C3","v":"2023-2024"}]
[null,26,"Actual","Actual","Budget"]
[null,"Line","12 mo.","12 mo.","12 mo."]
["UNENCUMBERED CASH BAL. - JULY 1",1,null,{"$f":"C24","v":0},{"$f":"D24","v":0}]
["Cancel of Prior Year Encumbrances",3]
[]
["REVENUES"]
["1000 LOCAL SOURCES              "]
["  1510 Interest on Idle Funds   ",5]
["  1900 Oth Rev From Local Source",15]
{"$rows_left_out":69}
{"sheet":"PAT28","index":12,"n_rows":97,"n_cols":5,"rows_kept":97,"cut":false,"hidden":false,"merged":[[96,0,96,4],[5,0,7,0],[10,0,10,4],[11,0,11,4],[34,0,34,4],[35,0,35,4],[31,0,33,0]]}
["State of Kansas",null,null,null,{"$f":"\"Interlocal #\"&Name!B1","v":"Interlocal #"}]
["Budget Form 0-212-900",null,null,null,{"$f":"Name!A2","v":""}]
[{"$f":"'Roll Over'!E1","v":"Rev. 6/2023"},null,null,null,{"$f":"LEFT(Name!A3,9)","v":"2023-2024"}]
[]
[null,null,1,2,3]
["PARENT EDUCATION PROGRAM","Code",{"$f":"'Roll Over'!C1","v":"2021-2022"},{"$f":"'Roll Over'!C2","v":"2022-2023"},{"$f":"'Roll Over'!C3","v":"2023-2024"}]
[null,28,"Actual","Actual","Budget"]
[null,"Line","12 mo.","12 mo.","12 mo."]
["UNENCUMBERED CASH BAL. - JULY 1",1,null,{"$f":"C25","v":0},{"$f":"D25","v":0}]
["Cancel of Prior Year Encumbrances",3]
[]
["REVENUES"]
["1000 LOCAL SOURCES              "]
["  1320 Payment from other School District",5]
["  1510 Interest on Idle Funds   ",15]
{"$rows_left_out":83}
{"sheet":"SuS29","index":13,"n_rows":161,"n_cols":5,"rows_kept":161,"cut":false,"hidden":false,"merged":[[160,0,160,4],[5,0,7,0],[11,0,11,4],[10,0,10,4],[29,0,29,4],[30,0,30,4],[26,0,28,0]]}
["State of Kansas",null,null,null,{"$f":"\"Interlocal #\"&Name!B1","v":"Interlocal #"}]
["Budget Form 0-212-900",null,null,null,{"$f":"Name!A2","v":""}]
[{"$f":"'Roll Over'!E1","v":"Rev. 6/2023"},null,null,null,{"$f":"LEFT(Name!A3,9)","v":"2023-2024"}]
[]
[null,null,1,2,3]
["SUMMER SCHOOL ","Code",{"$f":"'Roll Over'!C1","v":"2021-2022"},{"$f":"'Roll Over'!C2","v":"2022-2023"},{"$f":"'Roll Over'!C3","v":"2023-2024"}]
[null,29,"Actual","Actual","Budget"]
[null,"Line","12 mo.","12 mo.","12 mo."]
["UNENCUMBERED CASH BAL. - JULY 1",1,null,{"$f":"C20","v":0},{"$f":"D20","v":0}]
["Cancel of Prior Year Encumbrances",3]
[]
["REVENUES"]
["1000 LOCAL SOURCES              "]
["  1510 Interest on Idle Funds",35]
["  1900  Other Revenue",37]
{"$rows_left_out":147}
{"sheet":"SpE30","index":14,"n_rows":242,"n_cols":5,"rows_kept":242,"cut":false,"hidden":false,"merged":[[45,0,45,4],[241,0,241,4],[34,0,34,4],[5,0,7,0],[10,0,10,4],[11,0,11,4],[44,0,44,4],[41,0,43,0]]}
["State of Kansas",null,null,null,{"$f":"\"Interlocal #\"&Name!B1","v":"Interlocal #"}]
["Budget Form 0-212-900",null,null,null,{"$f":"Name!A2","v":""}]
[{"$f":"'Roll Over'!E1","v":"Rev. 6/2023"},null,null,null,{"$f":"LEFT(Name!A3,9)","v":"2023-2024"}]
[]
[null,null,1,2,3]
["SPECIAL EDUCATION ","Code",{"$f":"'Roll Over'!C1","v":"2021-2022"},{"$f":"'Roll Over'!C2","v":"2022-2023"},{"$f":"'Roll Over'!C3","v":"2023-2024"}]
[null,30,"Actual","Actual","Budget"]
[null,"Line","12 mo.","12 mo.","12 mo."]
["UNENCUMBERED CASH BAL. - JULY 1",1,null,{"$f":"C34","v":0},{"$f":"D34","v":0}]
["Cancel of Prior Year Encumbrances",3]
[]
["REVENUES"]
["1000 LOCAL SOURCES              "]
["  1320 Payment from Districts (Assessment)",5]
["  1321 Payment from Districts (Flow-through)",7]
{"$rows_left_out":228}
{"sheet":"Voc34","index":15,"n_rows":162,"n_cols":5,"rows_kept":162,"cut":false,"hidden":false,"merged":[[5,0,7,0],[11,0,11,4],[10,0,10,4],[39,0,40,4],[161,0,161,4],[36,0,38,0]]}
["State of Kansas",null,null,null,{"$f":"\"Interlocal #\"&Name!B1","v":"Interlocal #"}]
["Budget Form 0-212-900",null,null,null,{"$f":"Name!A2","v":""}]
[{"$f":"'Roll Over'!E1","v":"Rev. 6/2023"},null,null,null,{"$f":"LEFT(Name!A3,9)","v":"2023-2024"}]
[]
[null,null,1,2,3]
["CAREER AND POSTSECONDARY EDUCATION","Code",{"$f":"'Roll Over'!C1","v":"2021-2022"},{"$f":"'Roll Over'!C2","v":"2022-2023"},{"$f":"'Roll Over'!C3","v":"2023-2024"}]
[null,34,"Actual","Actual","Budget"]
[null,"Line","12 mo.","12 mo.","12 mo."]
["UNENCUMBERED CASH BAL. - JULY 1",1,null,{"$f":"C30","v":0},{"$f":"D30","v":0}]
["Cancel of Prior Year Encumbrances",3]
[]
["REVENUES"]
["1000 LOCAL SOURCES              "]
["  1300 Tuition                  "]
["    1320 Other School District/Government \n            (In-State)",25]
{"$rows_left_out":148}
{"sheet":"Misc35","index":16,"n_rows":234,"n_cols":5,"rows_kept":234,"cut":false,"hidden":false,"merged":[[233,0,233,4],[6,0,7,0],[39,0,40,0],[29,1,29,4],[30,0,31,0],[30,1,31,4],[27,0,27,4],[28,1,28,4]]}
["State of Kansas",null,null,null,{"$f":"\"Interlocal #\"&Name!B1","v":"Interlocal #"}]
["Form 0-212-900",null,null,null,{"$f":"Name!A2","v":""}]
[{"$f":"'Roll Over'!E1","v":"Rev. 6/2023"},null,null,null,{"$f":"LEFT(Name!A3,9)","v":"2023-2024"}]
[]
[null,null,1,2,3]
["GIFTS AND GRANTS","Code",{"$f":"'Roll Over'!C1","v":"2021-2022"},{"$f":"'Roll Over'!C2","v":"2022-2023"},{"$f":"'Roll Over'!C3","v":"2023-2024"}]
["(monies not included in other funds)",35,"Actual","Actual","Budget"]
[null,"Line","12 mo.","12 mo.","12 mo."]
["UNENCUMBERED CASH BAL. - JULY 1 ",1,null,{"$f":"C27","v":0},{"$f":"D27","v":0}]
["Cancel of Prior Year Encumbrances",3]
[]
["REVENUES"]
["1700 Student Activities1"]
["1710  Admissions",10]
["1730  Student Organization \n         Membership Dues",15]
{"$rows_left_out":220}
{"sheet":"C099","index":17,"n_rows":26,"n_cols":5,"rows_kept":26,"cut":false,"hidden":false,"merged":[[4,0,4,4]]}
["State of Kansas",null,null,null,{"$f":"\"Interlocal #\"&Name!$B$1","v":"Interlocal #"}]
["Budget Form 0-212-900",null,null,null,{"$f":"Name!$A$2","v":""}]
[{"$f":"'Roll Over'!E1","v":"Rev. 6/2023"},null,null,null,{"$f":"LEFT(Name!A3,9)","v":"2023-2024"}]
[]
["SUMMARY OF EXPENDITURES"]
[]
[null,null,1,2,3]
[null,"Code",{"$f":"'Roll Over'!C1","v":"2021-2022"},{"$f":"'Roll Over'!C2","v":"2022-2023"},{"$f":"'Roll Over'!C3","v":"2023-2024"}]
[null,99,"Actual","Actual ","Budgeted"]
[null,"Line","Expenditures","Expenditures","Expenditures"]
["  General Fund",6,{"$f":"'Gen06'!C22","v":0},{"$f":"'Gen06'!D22","v":0},{"$f":"'Gen06'!E22","v":0}]
["  Federal Funds",7,{"$f":"'Fed07'!C23","v":0},{"$f":"'Fed07'!D23","v":0},{"$f":"'Fed07'!E23","v":0}]
["  Preschool-Aged At-Risk",11,{"$f":"'PK AtRsk11'!C22","v":0},{"$f":"'PK AtRsk11'!D22","v":0},{"$f":"'PK AtRsk11'!E22","v":0}]
["  At Risk (K-12)",13,{"$f":"'K-12AtRsk13'!C22","v":0},{"$f":"'K-12AtRsk13'!D22","v":0},{"$f":"'K-12AtRsk13'!E22","v":0}]
["  Capital Outlay",16,{"$f":"'Cap16'!C24","v":0},{"$f":"'Cap16'!D24","v":0},{"$f":"'Cap16'!E24","v":0}]
{"$rows_left_out":12}
{"sheet":"Salaries","index":18,"n_rows":26,"n_cols":12,"rows_kept":26,"cut":false,"hidden":false,"merged":[[6,1,6,3],[6,5,6,7],[6,9,6,11],[4,0,4,11],[15,3,15,11],[16,3,16,11],[15,1,15,2],[16,1,16,2],[15,0,16,0],[14,0,14,11],[22,0,22,11],[23,0,23,11],[24,0,24,11],[25,0,25,11],[17,1,17,11],[18,1,18,11],[19,1,19,11],[20,1,20,11],[21,1,21,11]]}
["State of Kansas",null,null,null,null,null,null,null,null,null,null,{"$f":"\"Interlocal #\"&Name!$B$1","v":"Interlocal #"}]
[null,null,null,null,null,null,null,null,null,null,null,{"$f":"Name!A2","v":""}]
[null,null,null,null,null,null,null,null,null,null,null,{"$f":"LEFT(Name!A3,9)","v":"2023-2024"}]
[]
["AVERAGE SALARY"]
[]
[null,{"$f":"'Roll Over'!C1&\" Actuals\"","v":"2021-2022 Actuals"},null,null,null,{"$f":"'Roll Over'!C2&\" Actuals\"","v":"2022-2023 Actuals"},null,null,null,{"$f":"'Roll Over'!C3&\" Contracted\"","v":"2023-2024 Contracted"}]
[null,"FTE","Total Salary","Average Salary",null,"FTE","Total Salary","Average Salary",null,"FTE","Total Salary","Average Salary"]
["Administrators \n(Licensed/Non-Licensed)",null,null,{"$f":"IF(B9<1,C9,C9/B9)","v":0},null,null,null,{"$f":"IF(F9<1,G9,G9/F9)","v":0},null,null,null,{"$f":"IF(J9<1,K9,K9/J9)","v":0}]
["Teachers (Full Time)",null,null,{"$f":"IF(B10<1,C10,C10/B10)","v":0},null,null,null,{"$f":"IF(F10<1,G10,G10/F10)","v":0},null,null,null,{"$f":"IF(J10<1,K10,K10/J10)","v":0}]
["Other Licensed Personnel",null,null,{"$f":"IF(B11<1,C11,C11/B11)","v":0},null,null,null,{"$f":"IF(F11<1,G11,G11/F11)","v":0},null,null,null,{"$f":"IF(J11<1,K11,K11/J11)","v":0}]
["Classified Personnel",null,null,{"$f":"IF(B12<1,C12,C12/B12)","v":0},null,null,null,{"$f":"IF(F12<1,G12,G12/F12)","v":0},null,null,null,{"$f":"IF(J12<1,K12,K12/J12)","v":0}]
["Substitutes/Temporary Help","~~~~~~",null,"~~~~~~~~~~",null,"~~~~~~",null,"~~~~~~~~~~",null,"~~~~~~",null,"~~~~~~~~~~"]
[]
["DEFINITIONS"]
{"$rows_left_out":12}
{"sheet":"Roll Over","index":19,"n_rows":17,"n_cols":10,"rows_kept":17,"cut":false,"hidden":true,"merged":[[5,4,5,6],[0,5,1,5],[2,2,3,2],[2,1,3,1],[0,0,1,0],[0,4,1,4],[0,3,1,3]]}
["Used throughout the budget\n(edit highlighted fields only):","Column 1",{"$f":"F4-2&G4&F4-1","v":"2021-2022"},"Revision Date",{"$f":"\"Rev. 6/\"&F4","v":"Rev. 6/2023"},"Due Date\n(used on Name tab):","August",25,null,"x"]
[null,"Column 2",{"$f":"F4-1&G4&F4","v":"2022-2023"},null,null,null,"(Month)","(Day)",null,"x"]
[null,"Column 3\n(Budget Years)",{"$f":"F4&G4&H4","v":"2023-2024"},null,null,null,null,null,null,{"$f":"IF(SUM('Gen06'!$C$22:$E$22)>0,\"x\",\"\")","v":""}]
[null,null,null,null,"School Year",2023,"-",2024,null,{"$f":"IF(SUM('Fed07'!$C$23:$E$23)>0,\"x\",\"\")","v":""}]
[null,null,null,null,null,null,null,null,null,{"$f":"IF(SUM('PK AtRsk11'!$C$22:$E$22)>0,\"x\",\"\")","v":""}]
[null,null,"Amount","Percent","Comma separated amount for text entry",null,null,null,null,{"$f":"IF(SUM('K-12AtRsk13'!$C$22:$E$22)>0,\"x\",\"\")","v":""}]
[null,"Form 118",30800,0.8,"30","800",null,null,null,{"$f":"IF(SUM('Cap16'!$C$24:$E$24)>0,\"x\",\"\")","v":""}]
[null,null,null,null,null,null,null,null,null,{"$f":"IF(SUM('Ext22'!$C$20:$E$20)>0,\"x\",\"\")","v":""}]
[null,null,null,null,null,null,null,null,null,{"$f":"IF(SUM(Food24!$C$29:$E$29)>0,\"x\",\"\")","v":""}]
[null,null,null,null,null,null,null,null,null,{"$f":"IF(SUM(Prof26!$C$23:$E$23)>0,\"x\",\"\")","v":""}]
[null,null,null,null,null,null,null,null,null,{"$f":"IF(SUM('PAT28'!$C$24:$E$24)>0,\"x\",\"\")","v":""}]
[null,null,null,null,null,null,null,null,null,{"$f":"IF(SUM('SuS29'!$C$19:$E$19)>0,\"x\",\"\")","v":""}]
[null,null,null,null,null,null,null,null,null,{"$f":"IF(SUM('SpE30'!$C$33:$E$33)>0,\"x\",\"\")","v":""}]
[null,null,null,null,null,null,null,null,null,{"$f":"IF(SUM('Voc34'!$C$29:$E$29)>0,\"x\",\"\")","v":""}]
[null,null,null,null,null,null,null,null,null,{"$f":"IF(SUM(Misc35!$C$26:$E$26)>0,\"x\",\"\")","v":""}]
{"$rows_left_out":2}